sbi error

  P lease note this transaction number for future reference: IF34830887 Transaction Status Amount cannot be less than minimum period balance...

Showing posts with label error messages. Show all posts
Showing posts with label error messages. Show all posts
This is probably not the site you are looking for!
You attempted to reach windrolinx.com, but instead you actually reached a

server identifying itself as *.hrn9.com. This may be caused by a

misconfiguration on the server or by something more serious. An attacker on

your network could be trying to get you to visit a fake (and potentially

harmful) version of windrolinx.com. You should not proceed.

in css if we add more than one id 's in same style some error comes, like
#dropList ul#menu li.level1-li a.level1-a:hover, #dropList ul#menu

li.level1-li:hover a.level1-a {}
in this case width set only in
    FA: SQL script execution failed in line 21: You have an error in your SQL syntax; check the manual that corresponds to your MySQL server version for the right syntax to use near 'TYPE=MyISAM AUTO_INCREMENT=2' at line 7 myadmin The additional features for working with linked tables have been deactivated. To find out why click here. Your configuration file contains settings (root with no password) that correspond to the default MySQL privileged account. Your MySQL server is running with this default, is open to intrusion, and you really should fix this security hole by setting a password for user 'root'. localhost:

    Object not found!

    The requested URL was not found on this server. The link on the referring page seems to be wrong or outdated. Please inform the author of that page about the error.

    If you think this is a server error, please contact the webmaster.

    file upload websites:
    The requested file is not found
    We are sorry, the file was removed either by its owner
    or due to the complaint received
    Download Error

    Free users may only download 1 file at a time.

    Upgrade to Premium for parallel downloads.
    Your IP address 202.88.233.140 is currently downloading a 14374467 byte ZIP

    file.

    Please finish this download before starting another one. If you have just

    recently canceled this download, try again in a few minutes, as the

    download connection may not have terminated yet. If 202.88.233.140 is not

    your IP address, you may be sharing a proxy or NAT gateway with other

    users. If you have configured an HTTP proxy in your browser, disable it and

    try again. If you don't have a proxy configured, using a different download

    port may bypass your ISP's proxy. If you see your real IP address listed

    below, please select it, then try your download again:

    Download not available
    The following download is not available:

    https://rapidshare.com/files/413601400/rt_crystalline_v1.5.7.zip | 0.00 MB

    The file of the above link no longer exists. This could be for several

    reasons:

    The uploader deleted the file.
    The file contained illegal contents and was deleted from our servers by

    our abuse-team.
    The link is incorrect.
    The server is busy and can not process the request.

AdSense

We apologise for the inconvenience, but we are unable to process your

request at this time. Our engineers have been notified of this problem and

will work to resolve it.

 One or more of your sites has been in violation of AdSense policies.
YouTube earnings will be added to your AdSense payments page before the

15th of each month, and will included in your payment if your total

earnings exceed the payment threshold. Estimated earnings will not be

updated to include your YouTube earnings.

Error Messages

Forbidden

You don't have permission to access /bmc/ on this server.
Additionally, a 404 Not Found error was encountered while trying to use an ErrorDocument to handle the request.

error messages

 page not found
We are sorry, the page you are looking for is not

available at 

You may have entered an incorrect URL (Web address) or

you have followed an out of date link to a page

previously on our site. If you typed the page address

directly into the Address Bar, please make sure you have

spelled it correctly.
UH-OH!

Okay, so maybe not the page you were expecting.

But as you can see, we've got SPIKE working on it.

While we make some repairs, feel free to contact us or

check out our home page.
Please return to the home page to perform a new job

search
Page data is inconsistent with database. (18,1)

When trying to save your page data, the system found

that the information currently in the database did not

match what was expected.

This problem can happen if another user has changed the

same information while you were making your changes.

Note the changes you have made, then cancel the page.  

Reload the page and view any changes made by the other

user.  Ensure your changes are compatible and retry, if

appropriate.

If the problem persists, it may be a result of an

application or other programming error and should be

reported to technical support staff.

Possible application errors that can cause this message

include:
- changing page data from SavePostChange PeopleCode,

without making a corresponding change to the database.
- changing the database via SqlExec at various points,

for data that is also in the component buffers.
- database auto-update fields maintained by triggers

didn't get defined correctly in Record Field definition

or in Record Properties definition.

YouTube, error messages,

System.IO.FileNotFoundException Could not load file or

assembly 'Microsoft.WindowsAzure.ServiceRuntime,

Version=1.7.0.0, Culture=neutral,

PublicKeyToken=31bf3856ad364e35' or one of its

dependencies. The system cannot find the file specified.

JavaScript must be enabled for you to use Orkut.

However, it seems JavaScript is either disabled or not

supported by your browser. For Orkut to work properly,

enable JavaScript by changing your browser options, then

try again.

"This website/URL has been blocked until further notice

either pursuant to Court orders or on the Directions

issued by the Department of Telecommunications"

Error in "Please provide any additional information that

will help us determine your eligibility for the program.

If you do not have a significant audience on YouTube

today (e.g. if you are interested primarily in offering

rentals on YouTube), we highly encourage you to provide

as much information as you can to demonstrate that your

content has the potential to appeal to a broad audience

on YouTube.": This is a required field

web aaplication software error messages

Hear what they're saying
These people let anyone subscribe to things they share

publicly. Click subscribe next to someone you'd like to

hear from, and you'll get their public updates in your

News Feed.

    No results found. Please try again later.

 Page Not Found

Uh oh! It looks like you've tried to get to a page that

doesn't exist. If you really think something important

has gone missing, let us know.

Otherwise, perhaps you can start browsing our site from

our homepage.

portal error messages

Forbidden (403) CSRF verification failed. Request aborted. More information is available with DEBUG=True. Sorry, but www.raaga.com is blocked on this network. This site was categorized in: Music Contact your network administrator I'm sorry. Either your session timed out or you were trying to activate a feed more than once. Please try again. The feed was cancelled and not activated. Gone The requested resource /archives/2010/02/24/the-game-is-afoot is no longer available on this server and there is no forwarding address. Please remove all references to this resource.

Yahoo good error message

Notice  Upcoming calendar upgrade: Yahoo! Groups calendars are being upgraded to a much improved version. You may not have access to the calendar (for up to 24 hours) when this group is upgraded. We sincerely apologize for this inconvenience.

Access denied

Error Code : 1227 Access denied; you need the SUPER privilege for this operation (0 ms taken) Net.Mail.SmtpException: Failure sending mail. ---> System.Net.WebException: Unable to connect to the remote server ---> System.Net.Sockets.SocketException: A connection attempt failed because the connected party did not properly respond after a period of time, or established connection failed because connected host has failed to respond 64.62.143.85:25 at System.Net.Sockets.Socket.DoConnect(EndPoint endPointSnapshot, SocketAddress socketAddress) at System.Net.Sockets.Socket.InternalConnect(EndPoint remoteEP) at System.Net.ServicePoint.ConnectSocketInternal(Boolean connectFailure, Socket s4, Socket s6, Socket& socket, IPAddress& address, ConnectSocketState state, IAsyncResult asyncResult, Int32 timeout, Exception& exception) --- End of inner exception stack trace --- at System.Net.ServicePoint.GetConnection(PooledStream PooledStream, Object owner, Boolean async, IPAddress& address, Socket& abortSocket, Socket& abortSocket6, Int32 timeout) at System.Net.PooledStream.Activate(Object owningObject, Boolean async, Int32 timeout, GeneralAsyncDelegate asyncCallback) at System.Net.PooledStream.Activate(Object owningObject, GeneralAsyncDelegate asyncCallback) at System.Net.ConnectionPool.GetConnection(Object owningObject, GeneralAsyncDelegate asyncCallback, Int32 creationTimeout) at System.Net.Mail.SmtpConnection.GetConnection(String host, Int32 port) at System.Net.Mail.SmtpTransport.GetConnection(String host, Int32 port) at System.Net.Mail.SmtpClient.GetConnection() at System.Net.Mail.SmtpClient.Send(MailMessage message) --- End of inner exception stack trace --- at System.Net.Mail.SmtpClient.Send(MailMessage message) at WebApplication1._Default.SendMail(String filepath) in E:\Study\WebApplication1\WebApplication1\Default.aspx.cs:line 86 Error SQL query: DEFAULT CHARACTER SET latin1 COLLATE latin1_swedish_ci; MySQL said: Documentation #1064 - You have an error in your SQL syntax; check the manual that corresponds to your MySQL server version for the right syntax to use near 'DEFAULT CHARACTER SET latin1 COLLATE latin1_swedish_ci' at line 1

Confirmation Error

Confirmation Error There was a problem creating your performer account. Unable to locate your account. Your username and password returned no results. Please try again. 403 Forbidden: The server understood the request, but is refusing to fulfill it.
Cannot complete the install because one or more required items could not be found. Software being installed: Oracle WebLogic Server Tools 1.7.3.201107052022 (oracle.eclipse.tools.helios.weblogic.feature.group 1.7.3.201107052022) Missing requirement: Oracle Common Tools 3.2.3.201107052022 (oracle.eclipse.tools.common 3.2.3.201107052022) requires 'bundle org.eclipse.jdt.apt.core [3.3.400,3.4.0)' but it could not be found Cannot satisfy dependency: From: Oracle Common Tools 1.7.3.201107052022 (oracle.eclipse.tools.helios.common.feature.group 1.7.3.201107052022) To: oracle.eclipse.tools.common [3.2.3.201107052022] Cannot satisfy dependency: From: Oracle WebLogic Server Tools 1.7.3.201107052022 (oracle.eclipse.tools.helios.weblogic.feature.group 1.7.3.201107052022) To: oracle.eclipse.tools.helios.common.feature.group 0.0.0 Cannot complete the install because one or more required items could not be found. Software being installed: Geronimo Core Feature 2.1.1 (org.apache.geronimo.feature.feature.group 2.1.1) Missing requirement: Geronimo Core Feature 2.1.1 (org.apache.geronimo.feature.feature.group 2.1.1) requires 'org.eclipse.jst.feature.group [2.0.0,3.0.0)' but it could not be found An error occurred while communicating with the server.Reload Please use this feature carefully. Only add people who you know. Using this feature for sending unwanted emails can result in account deactivation. Servlet has thrown exception:javax.servlet.ServletException: Timed out We detect that you are not using a FastCGI handler mapping for PHP. You will need to install/configure a version that is compatible with the Sugar application. Please consult the Compatibility Matrix in the Release Notes for supported Versions. Please see http://www.iis.net/php/ for details Warning: fopen(cache/include/javascript/sugar_grp1_jquery.js) [function.fopen]: failed to open stream: Permission denied in /home/windroli/public_html/sugarcrm/SugarCE-Full-6.5.0beta1/include/utils/sugar_file_utils.php on line 111 Warning: fopen(cache/include/javascript/sugar_field_grp.js) [function.fopen]: failed to open stream: Permission denied in /home/windroli/public_html/sugarcrm/SugarCE-Full-6.5.0beta1/include/utils/sugar_file_utils.php on line 111 ----------------------------------- Skyrocket Labs is now closed. Due to a lack of time, I have shut down the web site. I will be blogging again soon but the Labs itself is no longer a realistic venture in terms of time investment. I've had a great time with this project and want to thank everyone for their support and encouragement over the last couple of years. Stay well. ;) An operation on a socket could not be performed because the system lacked sufficient buffer space or because a queue was full.
HTTP/1.1 200 OK Date: Fri, 27 Jan 2012 08:28:06 GMT Server: Apache/2.2.14 (Unix) mod_ssl/2.2.14 OpenSSL/0.9.8i DAV/2 mod_auth_passthrough/2.1 mod_bwlimited/1.4 FrontPage/5.0.2.2635 X-Powered-By: PHP/5.2.12 Connection: close Transfer-Encoding: chunked Content-Type: text/html 245





The Vip Has Moved to its new home.



http://www.quicksellclassifieds.org

Warning: Unterminated comment starting line 103 in /home/mysoluti/public_html/loyality/model/db.php on line 103

Fatal error: Call to a member function getSiteSettings() on a non-object in /home/mysoluti/public_html/loyality/model/session.php on line 49


Warning: mysql_connect() [function.mysql-connect]: Can't connect to MySQL server on '198.162.0.22' (4)

in /home/mysoluti/public_html/loyality/pothys/model/db.php on line 19

Warning: mysql_select_db() [function.mysql-select-db]: Access denied for user

'nobody'@'spider.hrn9.com' (using password: NO) in

/home/mysoluti/public_html/loyality/pothys/model/db.php on line 20

Warning: mysql_select_db() [function.mysql-select-db]: A link to the server could not be established in

/home/mysoluti/public_html/loyality/pothys/model/db.php on line 20

Warning: mysql_query() [function.mysql-query]: Access denied for user 'nobody'@'spider.hrn9.com' (using

password: NO) in /home/mysoluti/public_html/loyality/pothys/model/db.php on line 43

Warning: mysql_query() [function.mysql-query]: A link to the server could not be established in

/home/mysoluti/public_html/loyality/pothys/model/db.php on line 43
Access denied for user 'nobody'@'spider.hrn9.com' (using password: NO)


Forbidden

You don't have permission to access /tc/ on this server.

Additionally, a 404 Not Found error was encountered while trying to use an ErrorDocument to handle the

request.


Fatal error: Call to a member function getSiteSettings() on a non-object in F:\xampp\htdocs\...\model\session.php on line 55

Error occured at:2011-12-10 11:27:40
Line no.:121
Error Code: 1304 - PROCEDURE DeleteImportData already exists

MyBB

Sys.WebForms.PageRequestManagerParserErrorException: The message received from the server could not be parsed. Common causes for this error are when the response is modified by calls to Response.Write(), response filters, HttpModules, or server trace is enabled.

Details: Error parsing near 'ChSZWYuIE5vLiBDRShQK


You are seeing this message because we detected too many continuous requests from your ip address in last few hours. In order to ensure fast responses to every user's queries and to also protect our data from being scraped by automatic programs, we will ask you to enter following verification code into the box below.


MyBB Internal Error

MyBB has experienced an internal error and cannot continue.

Error Type:
MyBB Error (41)
Error Message:
Your board has not yet been installed and configured. Please do so before attempting to browse it.

Please contact the MyBB Group for support.


-----




Warning: include(business.php) [function.include]: failed to open stream: No such file or directory in /home/thunderc/public_html/tc/templates/flowoo/index.php on line 110

Warning: include(business.php) [function.include]: failed to open stream: No such file or directory in /home/thunderc/public_html/tc/templates/flowoo/index.php on line 110

Warning: include() [function.include]: Failed opening 'business.php' for inclusion (include_path='.:/usr/lib/php:/usr/local/lib/php') in /home/thunderc/public_html/tc/templates/flowoo/index.php on line 110

System.NullReferenceException: Object reference not set to an instance of an object. at payment._removehck(String txt) in e:\Asianet Websistes\test.asianetdataline.com\payment.aspx.cs:line 356 at payment.Button1_Click(Object sender, EventArgs e) in e:\Asianet Websistes\test.asianetdataline.com\payment.aspx.cs:line 275



[R] Connecting to mysolution.co.in -> DNS=mysolution.co.in IP=184.105.237.216 PORT=21 (attempt # 5)
[R] Connected to mysolution.co.in
[R] 220---------- Welcome to Pure-FTPd [privsep] [TLS] ----------
[R] 220-You are user number 4 of 300 allowed.
[R] 220-Local time is now 13:34. Server port: 21.
[R] 220-This is a private system - No anonymous login
[R] 220-IPv6 connections are also welcome on this server.
[R] 220 You will be disconnected after 5 minutes of inactivity.
[R] USER musoluti
[R] 331 User musoluti OK. Password required
[R] PASS (hidden)
[R] 530 Login authentication failed
[R] Connection failed
[R] Delaying for 120 seconds before reconnect attempt #6
[R] Connecting to mysolution.co.in -> DNS=mysolution.co.in IP=184.105.237.216 PORT=21 (attempt # 6)
[R] Connected to mysolution.co.in
[R] 220---------- Welcome to Pure-FTPd [privsep] [TLS] ----------
[R] 220-You are user number 4 of 300 allowed.
[R] 220-Local time is now 13:37. Server port: 21.
[R] 220-This is a private system - No anonymous login
[R] 220-IPv6 connections are also welcome on this server.
[R] 220 You will be disconnected after 5 minutes of inactivity.

---------------------------

This webpage is not available
The server at www.google.com can't be found, because the DNS lookup failed. DNS is the web service that translates a website's name to its internet address. This error is most often caused by having no connection to the internet or a misconfigured network. It can also be caused by an unresponsive DNS server or a firewall preventing Google Chrome from accessing the network.
Here are some suggestions:
Reload this web page later.
Check your internet connection. Reboot any routers, modems, or other network devices you may be using.
Check your DNS settings. Contact your network administrator if you're not sure what this means.
Try disabling DNS prefetching by following these steps: Go to Wrench menu > Options > Under the Hood and deselect "Use DNS pre-fetching to improve page load performance."
Try adding Google Chrome as a permitted program in your firewall or antivirus software's settings. If it is already a permitted program, try deleting it from the list of permitted programs and adding it again.
If you use a proxy server, check your proxy settings or check with your network administrator to make sure the proxy server is working.
If you don't believe you should be using a proxy server, try the following steps: Go to Wrench menu > Options > Under the Hood > Change proxy settings > LAN Settings and deselect "Use a proxy server for your LAN."
Error 105 (net::ERR_NAME_NOT_RESOLVED): Unable to resolve the server's DNS address.

---------------------------------------------------------------------

Warning: Smarty error: unable to read resource: "unauthorized.tpl" in /home/linkdir/public_html/libs/smarty/Smarty.class.php on line 1095


---------------
Unable to connect to the Internet
Google Chrome can't display the webpage because your computer isn't connected to the Internet.

You can try to diagnose the problem by taking the following steps:

Click Start, click Run, type %windir%\network diagnostic\xpnetdiag.exe, and then click OK.
Error 106 (net::ERR_INTERNET_DISCONNECTED): The Internet connection has been lost.

-------------

Maintenance Mode

Andrew Paglinawan is currently undergoing scheduled maintenance.

Please try back again soon.

Sorry for the inconvenience.
-------------

Sorry, you are not allowed to add any more than (0) addon domains! The domain below was not setup!

--
Warning: ini_set() has been disabled for security reasons in /home/beamcons/public_html/website_design/libraries/joomla/session/session.php on line 102

Warning: ini_set() has been disabled for security reasons in /home/beamcons/public_html/website_design/libraries/joomla/session/session.php on line 105

Warning: ini_set() has been disabled for security reasons in /home/beamcons/public_html/website_design/libraries/joomla/session/session.php on line 688

Warning: session_start() [function.session-start]: Cannot send session cookie - headers already sent by (output started at /home/beamcons/public_html/website_design/libraries/joomla/session/session.php:102) in /home/beamcons/public_html/website_design/libraries/joomla/session/session.php on line 423

Warning: session_start() [function.session-start]: Cannot send session cache limiter - headers already sent (output started at /home/beamcons/public_html/website_design/libraries/joomla/session/session.php:102) in /home/beamcons/public_html/website_design/libraries/joomla/session/session.php on line 423

Warning: Cannot modify header information - headers already sent by (output started at /home/beamcons/public_html/website_design/libraries/joomla/session/session.php:102) in /home/beamcons/public_html/website_design/libraries/joomla/session/session.php on line 426

softwares-errors-error codes- error messages

Operation Failed!: failed to open file C:\inetpub\vhosts\softlandindia.co.in\httpdocs\etm\templates\phosphorus\params.ini for writing.

This error can appear if a default printer has not been designated or if the application is unable to locate an existing default printer. To correct this problem, try one of the following in Microsoft Windows:
If a printer is not available in the Print dialog box, add a printer.
If the application cannot find an existing printer that is already installed, set the printer as the default printer.
If a default printer is installed but the application is unable to use it, uninstall the printer driver, and then install the latest version of the printer driver.
If the printer is on a print server, make sure the printer is available, the network is functioning, the server is not stalled, the printer is not out of paper, or the printer is not suspended by the administrator. Printing issues associated with a network printer are best handled by your local network administrator.
For more information about setting up and troubleshooting printer connections, see Windows Help and Support. (Click the Start button, and then click Help and Support.)


You cannot send more than 10 connection request per day.

jtablesession::Store Failed
DB function failed with error number 1146
Table 'jtheme.jos_session' doesn't exist SQL=INSERT INTO `jos_session` ( `session_id`,`time`,`username`,`gid`,`guest`,`client_id` ) VALUES ( '092324684f2972bf5d79b5ad36152615','1320841511','','0','1','0' )
Fatal error: Allowed memory size of 33554432 bytes exhausted (tried to allocate 44 bytes) in E:\xampp\htdocs\Siteshaper_Shape5_Phosphorus\libraries\joomla\error\exception.php on line 117



/* v1.4.3 1. changed how _cmSplit is handled a bit so that _cmNoClick can work
properly. All splits in predefined themes are changed to use
_cmNoClick instead of _cmNoAction.
*/
/* v1.4.2 1. fixed _cmNoClick mouse hoover bug.
2. fixed a statusbar text problem that cause text to disappear when
hoovering mouse within the same menu item.
3. changed the behavior of cmDrawFromText s.t. if the title of the
of a link is empty, the actual url is used as text. To clear
this link information, title needs to be ' '.
*/
/* v1.4.1 1. fixed a problem introduced in 1.4 where re-entering a main menu
item which doesn't have a child can disable its hover setting.
Apparently I deleted an extra line of code when I was doing
cleaning up. Reported by David Maliachi and a few others.
*/
/* JSCookMenu v1.4 1. fixed a minor td cell closure problem. Thanks to Georg Lorenz
for discovering that.
2. added clickOpen to nodeProperties. See _cmNodeProperties for
description. Basically menus can be opened on click only.
3. added an ability to draw menu from an html node instead of a javascript
tree, making this script search bot friendly (I hope?).
*/
/* JSCookMenu v1.31 1. fix a bug on IE with causes submenus to display at the top
left corner due to doctype. The fix was provided by
Burton Strauss .
*/
/* JSCookMenu v1.3 1. automatically realign (left and right) the submenu when
client space is not enough.
2. add _cmNoClick to get rid of menu closing behavior
on the particular menu item, to make it possible for things
such as search box to be inside the menu.
*/
/* JSCookMenu v1.25 1. fix Safari positioning issue. The problem is that all TR elements are located
at the top left corner. Thus, need to obtain the "virtual"
position of these element could be at.
*/
/* JSCookMenu v1.24 1. fix window based control hiding bug
thanks to Felix Zaslavskiy for the fix.
*/
/* JSCookMenu v1.23 1. correct a position bug when the container is positioned.
thanks to Andre for narrowing down
the problem.
*/
/* JSCookMenu v1.22 1. change Array.push (obj) call to Array[length] = obj.
Suggestion from Dick van der Kaaden to
make the script compatible with IE 5.0
2. Changed theme files a little to add z-index: 100 for sub
menus. This change is necessary for Netscape to avoid
a display problem.
3. some changes to the DOM structure to make this menu working
on Netscape 6.0 (tested). The main reason is that NN6 does
not do absolute positioning with tables. Therefore an extra
div layer must be put around the table.
*/
/* JSCookMenu v1.21 1. fixed a bug that didn't add 'px' as part of coordinates.
JSCookMenu should be XHTML validator friendly now.
2. removed unnecessary display attribute and corresponding
theme entry to fix a problem that Netscape sometimes
render Office theme incorrectly
*/
/* JSCookMenu v1.2. 1. fix the problem of showing status in Netscape
2. changed the handler parameters a bit to allow
string literals to be passed to javascript based
links
3. having null in target field would cause the link
to be opened in the current window, but this behavior
could change in the future releases
*/
/* JSCookMenu v1.5. added ability to hide controls in IE to show submenus properly */
/* JSCookMenu v1.01. cmDraw generates XHTML code */

web error messages and warnings

16.10.2011
osdate errors:

Deprecated: Assigning the return value of new by reference is deprecated in C:\xampp\htdocs\osdate\libs\Pear\DB.php on line 889

DB Error: connect failedDB_Error Object

Table creation is completed
Loading system control data to database... completed.
Loading sample data to database... completed.
Creating admin user and granting full permissions... completed.
Loading language files...
English language file is loaded...
Updating section question and options display order...completed.

Congratulations!!
osDate is now installed.


----------------------------------------------
17.10.2011
XAMPP
#2003 - Can't connect to MySQL server on 'localhost' (10061) Connection for controluser as defined in your configuration failed.
The MySQL server is not running or is blocked by a firewall! Please check this problem first ...With more XAMPP security, some examples will NOT execute error free. If you use PHP in "safe mode" for example, some functions of this security frontend will not work anymore. Often more security means less functionality.

phpmyadmin
No activity within 1440 seconds; please log in again

frontaccounting:
Cannot connect to database. User or password is invalid or you have no permittions to create database.
This is probably not the site you are looking for!
You attempted to reach windrolinx.com, but instead you actually reached a

server identifying itself as *.hrn9.com. This may be caused by a

misconfiguration on the server or by something more serious. An attacker on

your network could be trying to get you to visit a fake (and potentially

harmful) version of windrolinx.com. You should not proceed.

in css if we add more than one id 's in same style some error comes, like
#dropList ul#menu li.level1-li a.level1-a:hover, #dropList ul#menu

li.level1-li:hover a.level1-a {}
in this case width set only in
    FA: SQL script execution failed in line 21: You have an error in your SQL syntax; check the manual that corresponds to your MySQL server version for the right syntax to use near 'TYPE=MyISAM AUTO_INCREMENT=2' at line 7 myadmin The additional features for working with linked tables have been deactivated. To find out why click here. Your configuration file contains settings (root with no password) that correspond to the default MySQL privileged account. Your MySQL server is running with this default, is open to intrusion, and you really should fix this security hole by setting a password for user 'root'. localhost:

    Object not found!

    The requested URL was not found on this server. The link on the referring page seems to be wrong or outdated. Please inform the author of that page about the error.

    If you think this is a server error, please contact the webmaster.

    file upload websites:
    The requested file is not found
    We are sorry, the file was removed either by its owner
    or due to the complaint received
    Download Error

    Free users may only download 1 file at a time.

    Upgrade to Premium for parallel downloads.
    Your IP address 202.88.233.140 is currently downloading a 14374467 byte ZIP

    file.

    Please finish this download before starting another one. If you have just

    recently canceled this download, try again in a few minutes, as the

    download connection may not have terminated yet. If 202.88.233.140 is not

    your IP address, you may be sharing a proxy or NAT gateway with other

    users. If you have configured an HTTP proxy in your browser, disable it and

    try again. If you don't have a proxy configured, using a different download

    port may bypass your ISP's proxy. If you see your real IP address listed

    below, please select it, then try your download again:

    Download not available
    The following download is not available:

    https://rapidshare.com/files/413601400/rt_crystalline_v1.5.7.zip | 0.00 MB

    The file of the above link no longer exists. This could be for several

    reasons:

    The uploader deleted the file.
    The file contained illegal contents and was deleted from our servers by

    our abuse-team.
    The link is incorrect.
    The server is busy and can not process the request.

Warning: date() [function.date]: It is not safe to rely on the system's

timezone settings. You are *required* to use the date.timezone setting or

the date_default_timezone_set() function. In case you used any of those

methods and you are still getting this warning, you most likely misspelled

the timezone identifier. We selected 'Asia/Kolkata' for '5.5/no DST'

instead in E:\xampp\htdocs\siva\index.php on line 4

Popular Posts

My Famous Blog List